{"text_format":"1","workbook":"xlsx","n_sheets":5,"sheets":["EFV Calculator","Pressure Drop","What's New","Data and Formulas","Shift Calculations"],"not_rendered":{"charts":9,"images":2,"macros":1,"external_links":0,"defined_names":11,"comments":2,"pivot_tables":0},"unopened":[],"bounds":{"document_bytes":16777216,"sheet_cells":100000,"rows_first":2000,"rows_last":500,"rows_between":2000,"halvings":0,"cell_chars":16384,"cell_head_chars":4096},"cells_cut":0,"cells_raw":0,"read":"whole","date_system":"1900"}

{"sheet":"EFV Calculator","index":0,"n_rows":29,"n_cols":20,"rows_kept":29,"cut":false,"hidden":false,"merged":[[2,19,3,19],[15,0,15,3],[16,0,16,3],[1,0,4,2],[27,0,27,3],[20,0,20,3],[19,0,19,3],[2,17,3,17],[2,18,3,18],[21,0,21,3],[12,0,12,3],[13,0,13,3],[14,0,14,3],[26,1,26,3],[25,1,25,3],[0,0,0,2],[6,0,6,3],[8,0,8,3],[10,0,10,3],[18,0,18,3]]}
["Analysis Notes:"]
["Type Notes Here"]
[null,null,null,null,null,null,null,null,null,null,null,null,null,null,null,null,null,"Min.Trip SCFH","Max.Trip SCFH","Protected EQ FT"]
[null,null,null,null,null,null,null,null,null,null,null,null,null,null,null,null,"P"]
[null,null,null,null,null,null,null,null,null,null,null,null,null,null,null,null,5,{"$f":"VLOOKUP(Q5,'Data and Formulas'!$K$20:$Q$145,4)","v":424.18560336085727},{"$f":"VLOOKUP(Q5,'Data and Formulas'!$K$20:$Q$145,5)","v":636.27840504128585},{"$f":"VLOOKUP(Q5,'Data and Formulas'!$K$20:$Q$145,7)","v":3819.1427875327327}]
[null,null,null,null,null,null,null,null,null,null,null,null,null,null,null,null,null,{"$f":"VLOOKUP(Q6,'Data and Formulas'!$K$20:$Q$145,4)","v":366.3902975608201},{"$f":"VLOOKUP(Q6,'Data and Formulas'!$K$20:$Q$145,5)","v":549.58544634123018},{"$f":"VLOOKUP(Q6,'Data and Formulas'!$K$20:$Q$145,7)","v":0}]
["Minimum EFV Inlet Pressure (psig):",null,null,null,10,null,null,null,null,null,null,null,null,null,null,null,10,{"$f":"VLOOKUP(Q7,'Data and Formulas'!$K$20:$Q$145,4)","v":475.000002158445},{"$f":"VLOOKUP(Q7,'Data and Formulas'!$K$20:$Q$145,5)","v":712.50000323766744},{"$f":"VLOOKUP(Q7,'Data and Formulas'!$K$20:$Q$145,7)","v":7878.283218174467}]
[null,null,null,null,null,null,null,null,null,null,null,null,null,null,null,null,null,{"$f":"VLOOKUP(Q8,'Data and Formulas'!$K$20:$Q$145,4)","v":366.3902975608201},{"$f":"VLOOKUP(Q8,'Data and Formulas'!$K$20:$Q$145,5)","v":549.58544634123018},{"$f":"VLOOKUP(Q8,'Data and Formulas'!$K$20:$Q$145,7)","v":0}]
["Gas Specific Gravity:",null,null,null,0.6,null,null,null,null,null,null,null,null,null,null,null,15,{"$f":"VLOOKUP(Q9,'Data and Formulas'!$K$20:$Q$145,4)","v":520.88057940609656},{"$f":"VLOOKUP(Q9,'Data and Formulas'!$K$20:$Q$145,5)","v":781.32086910914484},{"$f":"VLOOKUP(Q9,'Data and Formulas'!$K$20:$Q$145,7)","v":11652.61476337032}]
[null,null,null,null,null,null,null,null,null,null,null,null,null,null,null,null,null,{"$f":"VLOOKUP(Q10,'Data and Formulas'!$K$20:$Q$145,4)","v":366.3902975608201},{"$f":"VLOOKUP(Q10,'Data and Formulas'!$K$20:$Q$145,5)","v":549.58544634123018},{"$f":"VLOOKUP(Q10,'Data and Formulas'!$K$20:$Q$145,7)","v":0}]
["Gas Temperature (°F):",null,null,null,60,null,null,null,null,null,null,null,null,null,null,null,20,{"$f":"VLOOKUP(Q11,'Data and Formulas'!$K$20:$Q$145,4)","v":563.03477153221991},{"$f":"VLOOKUP(Q11,'Data and Formulas'!$K$20:$Q$145,5)","v":844.5521572983298},{"$f":"VLOOKUP(Q11,'Data and Formulas'!$K$20:$Q$145,7)","v":15279.045491339148}]
[null,null,null,null,null,null,null,null,null,null,null,null,null,null,null,null,null,{"$f":"VLOOKUP(Q12,'Data and Formulas'!$K$20:$Q$145,4)","v":366.3902975608201},{"$f":"VLOOKUP(Q12,'Data and Formulas'!$K$20:$Q$145,5)","v":549.58544634123018},{"$f":"VLOOKUP(Q12,'Data and Formulas'!$K$20:$Q$145,7)","v":0}]
["Min Trip Flow (SCFH):",null,null,null,{"$f":"'Data and Formulas'!AE4","v":475.000002158445},null,null,null,null,null,null,null,null,null,null,null,30,{"$f":"VLOOKUP(Q13,'Data and Formulas'!$K$20:$Q$145,4)","v":639.05501004072846},{"$f":"VLOOKUP(Q13,'Data and Formulas'!$K$20:$Q$145,5)","v":958.58251506109264},{"$f":"VLOOKUP(Q13,'Data and Formulas'!$K$20:$Q$145,7)","v":22325.380988118082}]
["Max Trip Flow (SCFH):",null,null,null,{"$f":"'Data and Formulas'!AE5","v":712.50000323766744},null,null,null,null,null,null,null,null,null,null,null,40,{"$f":"VLOOKUP(Q14,'Data and Formulas'!$K$20:$Q$145,4)","v":706.9472807515225},{"$f":"VLOOKUP(Q14,'Data and Formulas'!$K$20:$Q$145,5)","v":1060.4209211272837},{"$f":"VLOOKUP(Q14,'Data and Formulas'!$K$20:$Q$145,7)","v":29268.3629773221}]
["Cushion between Min Trip Flow and Load:",null,null,null,0.1,null,null,null,null,null,null,null,null,null,null,null,50,{"$f":"VLOOKUP(Q15,'Data and Formulas'!$K$20:$Q$145,4)","v":768.86774523697397},{"$f":"VLOOKUP(Q15,'Data and Formulas'!$K$20:$Q$145,5)","v":1153.301617855461},{"$f":"VLOOKUP(Q15,'Data and Formulas'!$K$20:$Q$145,7)","v":36196.466326914095}]
{"$rows_left_out":15}
{"sheet":"Pressure Drop","index":1,"n_rows":21,"n_cols":6,"rows_kept":21,"cut":false,"hidden":false,"merged":[[2,5,8,7],[0,1,1,2],[11,1,11,2],[13,2,13,3],[1,5,1,7],[3,1,3,2],[9,1,9,2],[5,1,5,2]]}
[null,"EFV Series: "]
[null,null,null,null,null,"Analysis Notes:"]
[null,null,null,null,null,"Type Analysis Notes Here"]
[null,"Desired Flow Rate (SCFH):",null,400]
[]
[null,"EFV Min Trip Flow Rate (SCFH):",null,{"$f":"'Data and Formulas'!AL11","v":474.80757760035283}]
[]
[null,null,"Inlet Pressure (psig):",10]
[]
[null,"Gas Specific Gravity:",null,0.6]
[]
[null,"Gas Temperature (°F):",null,60]
[]
[null,null,"EFV Pressure Drop"]
[null,null,"at Desired Flow Rate (IWC):",{"$f":"'Data and Formulas'!AP11","v":7.2937391894610233}]
{"$rows_left_out":7}
{"sheet":"What's New","index":2,"n_rows":0,"n_cols":0,"rows_kept":0,"cut":false,"hidden":false,"merged":[]}

{"sheet":"Data and Formulas","index":3,"n_rows":145,"n_cols":42,"rows_kept":145,"cut":false,"hidden":true,"merged":[[16,36,17,36],[16,35,17,35],[8,35,9,41],[10,39,10,40],[11,39,11,40],[6,39,6,40],[12,39,12,40],[13,39,13,40],[0,33,144,33],[5,35,5,36],[6,35,6,36],[15,35,15,37],[10,35,10,36],[11,35,11,36],[16,37,17,37],[5,39,5,40],[0,39,0,41],[3,39,3,41],[4,39,4,40],[0,35,0,37],[1,35,1,36],[2,35,2,36],[3,35,3,36],[4,35,4,37],[0,27,0,31],[1,27,1,31],[7,27,7,31],[9,27,9,31],[2,27,2,28],[5,27,6,28],[8,27,8,28],[3,30,3,31],[4,30,4,31],[8,30,8,31],[3,27,3,28],[4,27,4,28],[16,11,16,14],[16,15,16,16],[17,13,18,13],[17,14,18,14],[17,12,18,12],[17,11,18,11],[17,4,18,4],[17,3,18,3],[17,0,18,0],[17,1,18,1],[0,19,0,23],[1,19,1,23],[3,19,3,23],[4,19,4,23],[2,19,2,23],[9,11,9,12],[0,11,0,13],[0,15,0,16],[7,11,7,13],[8,11,8,12],[3,11,3,12],[5,11,5,13],[6,11,6,12],[4,11,4,12],[16,27,16,30],[11,27,11,28],[10,27,10,28],[17,22,18,22],[17,30,18,30],[17,27,18,27],[17,28,18,28],[17,29,18,29],[17,23,18,23],[17,24,18,24],[17,25,18,25],[16,19,16,25],[10,4,10,7],[12,4,12,7],[16,17,18,17],[16,10,18,10],[57,5,57,6],[63,5,63,6],[60,5,60,6],[17,21,18,21],[17,19,18,19],[17,20,18,20],[10,11,10,12],[56,5,56,6],[17,16,18,16],[16,0,16,8],[54,0,55,0],[54,4,55,4],[54,3,55,3],[54,2,55,2],[54,1,55,1],[54,5,55,6],[17,6,17,8],[17,5,18,5],[52,0,53,6],[17,15,18,15],[58,5,58,6],[67,5,67,6],[62,5,62,6],[64,5,64,6],[65,5,65,6],[66,5,66,6],[59,5,59,6],[61,5,61,6],[17,2,18,2],[0,4,0,8],[11,4,11,7],[13,0,13,1],[14,0,14,1],[1,4,1,7],[2,4,2,7],[4,4,4,7],[6,4,6,7],[7,4,7,7],[8,4,8,7],[0,0,0,2],[1,0,1,1],[2,0,2,1],[3,0,3,1],[4,0,4,2],[8,0,8,2],[3,4,3,7],[5,4,5,7],[7,0,7,1],[11,0,11,1],[9,0,9,1],[10,0,10,1],[5,0,5,1],[6,0,6,1]]}
["EFV Calculator Data",null,null,null,"Calculations & Constants",null,null,null,null,null,null,"Lookup Values",null,null,null,"Reset Curve Coeff.",null,null,null,"Graph Labels",null,null,null,null,null,null,null,"Graph and Output Data",null,null,null,null,null,"Pressure Drop Chart",null,"Pressure Drop Data",null,null,null,"Lookup Values"]
["Selected EFV Size",null,8,null,"N7 - Numeric Constant",null,null,null,1360,null,null,"Flow Coefficient - Cv",null,{"$f":"VLOOKUP($C$2,$A$20:$E$53,3)","v":2.0358904421831787},null,"A=",-0.19,null,null,{"$f":"\"Anticipated Load w/ \"&'EFV Calculator'!E15*100&\"% Margin\"","v":"Anticipated Load w/ 10% Margin"},null,null,null,null,null,null,null,"Trip Curve Graph",null,null,null,null,null,null,null,"Selected EFV Size",null,8,null,"Flow Coefficient - Cv",null,{"$f":"VLOOKUP($AL$2,$A$20:$I$53,3,FALSE)","v":2.0358904421831787}]
["Selected Pipe Size",null,7,null,"Temp °R Upstream",null,null,null,{"$f":"459.67+C8","v":519.67000000000007},null,null,"Pressure Drop - DP",null,{"$f":"VLOOKUP($C$2,$A$20:$E$53,4)","v":10.295589165109771},null,"B=",0.1028,null,null,null,null,null,null,null,null,null,null,null,null,"P","Pt #1","Pt #2",null,null,null,"Selected Flowrate",null,{"$f":"'Pressure Drop'!D4","v":400},null,"Pressure Drop - DP (IWC)",null,{"$f":"VLOOKUP($AL$2,$A$20:$I$53,4,FALSE)","v":10.295589165109771}]
["Adjusted Pipe Size",null,{"$f":"IF($C$2<=4,1,$C$3)","v":7},null,null,null,null,null,null,null,null,"Max Limit - (% of Min)",null,{"$f":"VLOOKUP($C$2,$A$20:$I$53,5)","v":0.5},null,"C=",-5.8999999999999999E-3,null,null,{"$f":"AD11*100&\"% Bypass Flow\"","v":"45% Bypass Flow"},null,null,null,null,null,null,null,"Min Trip Flow @ P",null,{"$f":"$C$6","v":10},{"$f":"VLOOKUP(AD4,$K$20:$O$145,4)","v":475.000002158445},null,null,null,null,"Target Pressure",null,{"$f":"'Pressure Drop'!D8","v":10}]
[null,null,null,null,"Open to Atmosphere Pressure",null,null,null,0,null,null,"Bypass Rate",null,{"$f":"VLOOKUP($C$2,$A$20:$I$53,6)","v":0.45},null,"D=",1.56E-4,null,null,{"$f":"AD12*100&\"% Bypass Flow\"","v":"20% Bypass Flow"},null,null,null,null,null,null,null,"Max Trip Flow @ P",null,{"$f":"$C$6","v":10},{"$f":"VLOOKUP(AD5,$K$20:$O$145,5)","v":712.50000323766744},null,null,null,null,null,null,null,null,"Shift Coefficient A",null,{"$f":"VLOOKUP($AL$2,$A$20:$I$53,7,FALSE)","v":0}]
["Min System Pressure",null,{"$f":"'EFV Calculator'!$E$7","v":10},null,null,null,null,null,null,null,null,null,null,null,null,"E=",-3.9999999999999998E-7,null,null,null,null,null,null,null,null,null,null,"Max Anticipated \nLoad",null,{"$f":"MIN($K$20:$K$145)","v":0},{"$f":"'EFV Calculator'!E16","v":431.81818378040452},{"$f":"'EFV Calculator'!$E$19","v":390},null,null,null,"Specific Gravity",null,{"$f":"'Pressure Drop'!D10","v":0.6},null,"Shift Coefficient B",null,{"$f":"VLOOKUP($AL$2,$A$20:$I$53,8,FALSE)","v":0}]
["Specific Gravity",null,{"$f":"'EFV Calculator'!$E$9","v":0.6},null,"Conversion ft3 to dry gal",null,null,null,6.4279999999999999,null,null,"Pipe Inside Diameter",null,{"$f":"VLOOKUP($C$4,$A$57:$E$83,5)","v":1.0609999999999999},null,null,null,null,null,null,null,null,null,null,null,null,null,null,null,{"$f":"MAX($K$20:$K$145)","v":125},{"$f":"AE6","v":431.81818378040452},{"$f":"AF6","v":390},null,null,null,"Gas Temperature (°F)",null,{"$f":"'Pressure Drop'!D12","v":60},null,"Shift Coefficient C",null,{"$f":"VLOOKUP($AL$2,$A$20:$I$53,9,FALSE)","v":0}]
["Gas Temperature (°F)",null,{"$f":"'EFV Calculator'!$E$11","v":60},null,"Volume added for the Nipple",null,null,null,15.5,null,null,null,null,null,null,null,null,null,null,null,null,null,null,null,null,null,null,"Equivalent Service Length Curve Graph"]
[null,null,null,null,"Volume of Pipe (Dry Gallon)",null,null,null,{"$f":"((N7/2)^2*PI()*C11*12+(I8))*0.003720203","v":4.0046759379389556},null,null,"Shift Coefficient A",null,{"$f":"VLOOKUP($C$2,$A$20:$I$53,7)","v":0},null,null,null,null,null,null,null,null,null,null,null,null,null,"Equiv. Length @ Inlet Pressure",null,{"$f":"$C$6","v":10},{"$f":"VLOOKUP(AD9,$K$20:$Q$145,7)","v":7878.283218174467},null,null,null,null,"Calculations"]
["System Pressure",null,{"$f":"'EFV Calculator'!E26","v":10},null,null,null,null,null,null,null,null,"Shift Coefficient B",null,{"$f":"VLOOKUP($C$2,$A$20:$I$53,8)","v":0},null,null,null,null,null,null,null,null,null,null,null,null,null,"EFV Reset Time Chart"]
["Service Line Length",null,{"$f":"'EFV Calculator'!E27","v":100},null,"Calculated Minimum Pressure @ max trip",null,null,null,{"$f":"(1/1849600*(459.67+$C$8)*$C$7*($AE$5^2/($N$2^2*($C$6+14.696))))","v":0.8360560571396527},null,null,"Shift Coefficient C",null,{"$f":"VLOOKUP($C$2,$A$20:$I$53,9)","v":0},null,null,null,null,null,null,null,null,null,null,null,null,null,"Target Reset Point",null,{"$f":"N5","v":0.45},{"$f":"VLOOKUP(AD11,$W$20:$Z$39,3,FALSE)","v":4.8512445495381709},{"$f":"VLOOKUP(AD11,$W$20:$Z$39,4,FALSE)","v":3.3680555555555551E-3},null,null,null,"Min EFV Trip Flow",null,{"$f":"($I$2*$AP$2*(14.67+AL4)*((($AP$3*0.0361)/(14.67+AL4))/($AL$6*(459.67+$AL$7)))^0.5)+($AP$5*AL4^2+$AP$6*AL4+$AP$7)","v":474.80757760035283},null,"DP (IWC)",null,{"$f":"AP12/0.036127292","v":7.2937391894610233}]
["Estimated Bypass",null,{"$f":"'EFV Calculator'!B29","v":0.2},null,"Calculated Minimum Pressure @ desired load",null,null,null,{"$f":"C6-(1/1849600*(459.67+$C$8)*$C$7*(C14^2/($N$2^2*(C6+14.696))))","v":9.7495074174005545},null,null,null,null,null,null,null,null,null,null,null,null,null,null,null,null,null,null,"User Reset Point",null,{"$f":"C12","v":0.2},{"$f":"VLOOKUP(AD12,$W$20:$Y$39,3,FALSE)","v":10.915300236460885},{"$f":"VLOOKUP(AD12,$W$20:$Z$39,4,FALSE)","v":7.5694444444444446E-3},{"$f":"IF(AE12>1440,TRUNC(AE12/1440)&\" Day(s)\",\"\")","v":""},null,null,"Flowrate Step Size",null,{"$f":"AL11/125","v":3.7984606208028224},null,"DP (psi)",null,{"$f":"1/1849600*(459.67+$AL$7)*$AL$6*($AL3^2/($AP$2^2*($AL$4+14.696)))","v":0.26350304546950171}]
[null,null,null,null,"Calc Max Pressure at Regulator @ desired load",null,null,null,{"$f":"(C6-(1/1849600*(459.67+$C$8)*$C$7*(C14^2/($N$2^2*(C6+14.696)))))-0.5","v":9.2495074174005545},null,null,null,null,null,null,null,null,null,null,null,null,null,null,null,null,null,null,null,null,null,null,null,null,null,null,null,null,null,null,"DP (IWC) Actual",null,{"$f":"AP14/0.036127292","v":10.276980436409541}]
["Desired Load:",null,{"$f":"'EFV Calculator'!E19","v":390},null,"Estimated Equiv. Service Line Length (FT):",null,null,null,{"$f":"IF(I13<=0,0, (( (( (I13+14.69)^2-(($C$15)+14.69)^2 )-(0*0.0361) )/ ($C$8+459.67) ) / ( (C14/1000) / ( ( $N$7^(8/3) / ($C$7^(4/9) * (0.0105/1488.2)^(1/9) ) ) * ( 0.6643 * (60+459.67) / 14.69) ) ) ^ (9/5)))","v":18319.561585127347},null,null,null,null,null,null,null,null,null,null,null,null,null,null,null,null,null,null,null,null,null,null,null,null,null,null,null,null,null,null,"DP (psi) Actual",null,{"$f":"1/1849600*(459.67+$AL$7)*$AL$6*($AL11^2/($AP$2^2*($AL$4+14.696)))","v":0.37127947310445492}]
["Desired Pressure at Regulator (psig):",null,{"$f":"'EFV Calculator'!E21","v":2.5}]
{"$rows_left_out":131}
{"sheet":"Shift Calculations","index":4,"n_rows":137,"n_cols":64,"rows_kept":137,"cut":false,"hidden":true,"merged":[[0,0,0,21],[26,35,27,35],[26,34,27,34],[9,43,9,46],[2,7,2,9],[7,7,7,8],[0,22,112,22],[9,23,10,23],[10,33,11,33],[18,33,19,33],[9,0,10,0],[9,11,10,11],[3,7,3,8],[4,7,4,8],[5,7,5,8],[3,3,3,4],[0,63,112,63],[2,38,2,40],[3,24,3,25],[3,38,3,39],[4,38,4,39],[6,38,6,39],[9,24,9,27],[0,23,0,62],[18,34,18,36],[10,34,10,36],[4,31,5,31],[9,28,9,31],[9,38,9,41],[4,27,5,27],[8,28,8,31],[9,33,9,36],[9,47,10,47],[5,38,5,39],[5,43,5,44],[2,28,2,31],[3,28,3,29],[3,43,3,44],[4,43,4,44],[7,38,7,39],[9,42,10,42],[6,43,6,44],[7,43,7,44],[9,3,9,5],[9,7,9,10],[9,1,9,2],[2,1,2,2],[1,1,1,2],[2,3,2,5],[1,48,8,62],[2,24,2,27],[2,43,2,45],[1,3,1,5],[1,16,7,21],[1,13,1,14],[8,24,8,27]]}
["EFV I Series 1800",null,null,null,null,null,null,null,null,null,null,null,null,null,null,null,null,null,null,null,null,null,{"$f":"A1","v":"EFV I Series 1800"},"CEFV 3900 & 5500 Shift",null,null,null,null,null,null,null,null,null,null,null,null,null,null,null,null,null,null,null,null,null,null,null,null,null,null,null,null,null,null,null,null,null,null,null,null,null,null,null,{"$f":"X1","v":"CEFV 3900 & 5500 Shift"}]
[null,"Data -Old EFV \nCalculator",null,"Flow Data from CV Calculation",null,null,null,null,null,null,null,null,null,"Test Data (8-3-12)",null,null,"The Curve Fit Data from the Old EFV Calculator was compared to the theoretical Curve generated by the Cv Value.  The difference between these two values was plotted and the equation for the linear fit of these data points was used to generate a shift for the CV generated Curve.  The shifted Cv Curve was then plotted vs test data to show that the  shape holds up to empirical testing.  The green data is an offset curve at 41% of the minimum trip flow to simulate what perfect test data should have plotted on the chart.  It was very close to the actual data points.",null,null,null,null,null,null,null,null,null,null,null,null,null,null,null,null,null,null,null,null,null,null,null,null,null,null,null,null,null,null,null,"A similar approach was used to calculate the needed shift for the 3900 and 5500 CEFV.  The Cv Curve did not fit match the empirical data so a shift was created by taking an average of the 3900 from 1¼ and 2 IPS sizes and the 5500 from 1¼ and 2 IPS, then taking the difference at these points from the Cv Curve.  The differences for the 3900 and 5500 were then averaged and plotted with a 2nd order polynomial was used to fit the difference data.  This polynomial was used to create the shift coefficients that are listed in the boxes.  They are a little low for the 5500 and a little high for the 3900 but over estimate the two models very well.  The new shifted max and min trip are plotted on the chart along with data points so the shift can be seen.  The shift moves the shifted test curve to follow the data fairly close."]
[null,"Curve Fit Coefficients",null,"Values Used for Calculation",null,null,null,"Shift Values",null,null,null,null,null,"Pressure","Flowrate",null,null,null,null,null,null,null,null,null,"Values Used for Calculation",null,null,null,"Values Used for Calculation",null,null,null,null,null,null,null,null,null,"Shift Values",null,null,null,null,"Shift Values"]
[null,"a =",1610," Numeric Constant",null,1360,null,"Shift Coefficient A",null,4.8769999999999998,null,null,null,9.94,2539.7080000000001,null,null,null,null,null,null,null,null,null," Numeric Constant",null,1360,null," Numeric Constant",null,1360,null,null,null,null,null,null,null,"Shift Coefficient A",null,2.8299999999999999E-2,null,null,"Shift Coefficient A",null,2.8299999999999999E-2]
[null,"b =",58.4392,"Temp °R Upstream",null,{"$f":"60+459.67","v":519.67000000000007},null,"Shift Coefficient B",null,-44.103000000000002,null,null,null,31.803999999999995,3495.9379999999996,null,null,null,null,null,null,null,null,null,"Temp °R Upstream",null,{"$f":"60+459.67","v":519.67000000000007},"Data Curve \n% of Min","Temp °R Upstream",null,{"$f":"60+459.67","v":519.67000000000007},"Data Curve \n% of Min",null,null,null,null,null,null,"Shift Coefficient B",null,18.369,null,null,"Shift Coefficient B",null,18.369]
[null,"c =",-0.42149999999999999,"Specific Gravity",null,0.6,null,"P Drop (iwc)",null,83.423080049267028,null,null,null,50.756,4450.9319999999998,null,null,null,null,null,null,null,null,null,"Specific Gravity",null,0.6,null,"Specific Gravity",null,0.6,null,null,null,null,null,null,null,"Shift Coefficient C",null,-186.52,null,null,"Shift Coefficient C",null,-186.52]
[null,"d =",2.0100000000000001E-3,"Flow Coefficient - Cv",null,2.7087540899626275,null,null,null,null,null,null,null,71.46599999999998,5200.0140000000001,null,null,null,null,null,null,null,null,null,"Flow Coefficient - Cv",null,17.573884444444445,{"$f":"(AI15-Z22)/Z22","v":0.25251464406635477},"Flow Coefficient - Cv",null,17.573884444444445,{"$f":"(AI23-AD22)/AD22","v":0.31672223715432951},null,null,null,null,null,null,"P Drop (psi)",null,9.3525300747582154,null,null,"P Drop (psi)",null,18.600527226717624]
[null,"Max %",0.5,"P Drop (iwc)",null,83.857362600159107,null,"Test Data Offset From Min",null,{"$f":"(O4-J22)/J22","v":0.41094888267614837},null,null,null,94.82,6013,null,null,null,null,null,null,null,null,null,"P Drop (psi)",null,9.3525283183951373,null,"P Drop (psi)",null,18.600524745693374,null,null,null,null,null,null,null,"Test Data Offset",null,{"$f":"(AI15-AO22)/AO22","v":0.25251452645804101},null,null,"Test Data Offset",null,{"$f":"(AI23-AT22)/AT22","v":0.31672214933907911}]
[]
["P","Curve Fit Data",null,"Cv Calculated Data",null,null,null,"Shifted Cv Calculated Data",null,null,null,"Test Data Shifted Curve  ",null,null,null,null,null,null,null,null,null,null,null,"P","3900 Cv Calculated Data",null,null,null,"5500 Cv Calculated Data",null,null,null,null,"Data from lab test 2012 012",null,null,null,null,"3900 Shifted Cv Calculated Data",null,null,null,"Test Data Shifted Curve  ","5500 Shifted Cv Calculated Data",null,null,null,"Test Data Shifted Curve  "]
[null,"Min Trip Point","Max Trip Point","x","Min Trip Flow","Max Trip Flow","Min Trip Flow Difference","x","Shift","Min Trip Flow","Max Trip Flow",null,null,null,null,null,null,null,null,null,null,null,null,null,"x","Min Trip Flow","Max Trip Flow","Curve at Data","x","Min Trip Flow","Max Trip Flow","Curve at Data",null,null,"CEFV Series 3900\nAverage of Qualification Data",null,null,null,"X","Shift","Min Trip Flow","Max Trip Flow",null,"X","Shift","Min Trip Flow","Max Trip Flow"]
[0,{"$f":"(1800/2154)*(C$4+C$5*$A12+C$6*$A12^2+C$7*$A12^3)","v":1345.4038997214486},{"$f":"(1+C$8)*B12","v":2018.1058495821731},{"$f":"($F$8*0.0361)/(14.59+A12)","v":0.20748805962068156},{"$f":"($F$4*$F$7*(14.59+A12)*(D12/($F$6*$F$5))^0.5)","v":1386.503233344579},{"$f":"E12*(1+$C$8)","v":2079.7548500168687},{"$f":"B12-E12","v":-41.099333623130406},{"$f":"($J$6*0.0361)/(14.59+A12)","v":0.2064135154063427},{"$f":"($J$4*A12)+$J$5","v":-44.103000000000002},{"$f":"($F$4*$F$7*(14.59+A12)*(H12/($F$6*$F$5))^0.5)+I12","v":1338.805344629417},{"$f":"J12*(1+$C$8)","v":2008.2080169441256},{"$f":"J12*(1+$J$8)","v":1888.985905125732},null,null,null,null,null,null,null,null,null,null,null,0,{"$f":"($AA$8*0.0361)/(14.59+X12)","v":2.3140937100347116E-2},{"$f":"($AA$4*$AA$7*(14.59+X12)*(Y12/($AA$6*$AA$5))^0.5)","v":3004.0903438156579},{"$f":"Z12*(1+$C$8)","v":4506.1355157234866},{"$f":"Z12*(1+$AB$7)","v":3762.6671477274422},{"$f":"($AE$8*0.0361)/(14.59+X12)","v":4.6023231207644337E-2},{"$f":"($AE$4*$AE$7*(14.59+X12)*(AC12/($AE$6*$AE$5))^0.5)","v":4236.5376624876517},{"$f":"AD12*(1+$C$8)","v":6354.8064937314775},{"$f":"AD12*(1+$AF$7)","v":5578.343348739314},null,null,10,60,108,null,{"$f":"($AO$7*0.0361)/(14.59+X12)","v":2.314094144611183E-2},{"$f":"$AO$4*X12^2+$AO$5*X12+$AO$6","v":-186.52},{"$f":"($AA$4*$AA$7*(14.59+X12)*(AM12/($AA$6*$AA$5))^0.5)+AN12","v":2817.5706258930245},{"$f":"AO12*(1+$C$8)","v":4226.355938839537},{"$f":"AO12*(1+$AO$8)","v":3529.0481382524881},{"$f":"($AT$7*0.0361)/(14.59+X12)","v":4.6023237346436346E-2},{"$f":"$AT$4*X12^2+$AT$5*X12+$AT$6","v":-186.52},{"$f":"($AE$4*$AE$7*(14.59+X12)*(AR12/($AE$6*$AE$5))^0.5)+AS12","v":4050.0179450321634},{"$f":"AT12*(1+$C$8)","v":6075.0269175482454},{"$f":"AT12*(1+$AO$8)","v":5072.7063085685286}]
[1,1393.8883370473538,2090.8325055710307,0.19417901153725106,1433.2313471627601,2149.8470207441401,{"$f":"B13-E13","v":-39.343010115406287},0.19317339254512764,-39.225999999999999,1390.2893030366295,{"$f":"J13*(1+$C$8)","v":2085.4339545549442},1961.6271387161335,null,null,null,null,null,null,null,null,null,null,null,1,{"$f":"($AA$8*0.0361)/(14.59+X13)","v":2.1656592193333192E-2},3105.3345905869382,4658.0018858804069,3889.4770494359386,{"$f":"($AE$8*0.0361)/(14.59+X13)","v":4.3071131707474716E-2},4379.3180104354851,6568.9770156532277,{"$f":"AD13*(1+$AF$7)","v":5766.3454079108587},null,"1¼",4842.8725599999998,9648.8674193548413,13057.050239999999,null,{"$f":"($AO$7*0.0361)/(14.59+X13)","v":2.1656596260344555E-2},{"$f":"$AO$4*X13^2+$AO$5*X13+$AO$6","v":-168.12270000000001},2937.2121821709138,{"$f":"AO13*(1+$C$8)","v":4405.818273256371},{"$f":"AO13*(1+$AO$8)","v":3678.9009254585917},{"$f":"($AT$7*0.0361)/(14.59+X13)","v":4.3071137452502004E-2},{"$f":"$AT$4*X13^2+$AT$5*X13+$AT$6","v":-168.12270000000001},4211.1956025023483,{"$f":"AT13*(1+$C$8)","v":6316.7934037535224},{"$f":"AT13*(1+$AO$8)","v":5274.5836658904136}]
[2,1441.6783955431758,2162.5175933147639,0.18247442976888148,1478.4833353490963,2217.7250030236446,-36.804939805920412,0.1815294267497613,-34.349000000000004,1440.3009630712834,2160.4514446069252,2032.1910345628078,null,null,null,null,null,null,null,null,null,null,null,2,2.0351191820015942E-2,3203.38056515067,4805.070847726005,4012.2810683687699,4.0474921236861416E-2,4517.5879745028642,6776.3819617542958,5948.4085443289068,null,2,4926.7416800000001,8882.4149494949452,13089.751920000002,null,2.0351195641878938E-2,-149.6688,3053.7120659409425,4580.5680989114135,3824.818722211226,4.0474926635594106E-2,-149.6688,4367.919475791271,6551.879213686907,5470.8825938275586]
[3,1488.7841532033428,2233.1762298050144,0.17210067025956474,1522.3908339582174,2283.586250937326,-33.60668075487456,0.17120939111873451,-29.472000000000001,1488.9716194855471,2233.4574292283205,2100.8628428496281,null,null,null,null,null,null,null,null,null,null,null,3,1.9194216730759776E-2,3298.5134789590138,4947.7702184385207,4131.4364360464233,3.8173902405885779E-2,4651.7497759683038,6977.6246639524561,6125.0623716951359,null,"Average",{"$f":"AVERAGE(AI13:AI14)","v":4884.8071199999995},{"$f":"AVERAGE(AJ13:AJ14)","v":9265.6411844248942},{"$f":"AVERAGE(AK13:AK14)","v":13073.40108},null,1.9194220335348015E-2,-131.1583,3167.3554886820539,4751.0332330230813,3967.1587600308799,3.8173907497697911E-2,-131.1583,4520.5917862042725,6780.8876793064082,5662.106880407754]
{"$rows_left_out":122}